{"text_format":"1","workbook":"xlsx","n_sheets":14,"sheets":["Error","All Systems","Summary","Report Template","Report","Pipe Details (104)","Pump Details","Pipe Details (Template)","Help Guide","Pipe Velocity Check","Lookup Values","Pipe System Lookup Values","Water Properties","Worksheet"],"not_rendered":{"charts":0,"images":33,"macros":1,"external_links":0,"defined_names":89,"comments":4,"pivot_tables":0},"unopened":[],"bounds":{"document_bytes":16777216,"sheet_cells":100000,"rows_first":2000,"rows_last":500,"rows_between":2000,"halvings":0,"cell_chars":16384,"cell_head_chars":4096},"cells_cut":0,"cells_raw":0,"read":"whole","date_system":"1900"}

{"sheet":"Error","index":0,"n_rows":3,"n_cols":1,"rows_kept":3,"cut":false,"hidden":false,"merged":[[2,0,2,5]]}
[]
[]
["The Pump System Calculator requires macros to function. Please choose Enable Macros when opening the workbook. If this option is not available, then please see your IT administrator to ensure you have the appropriate privileges to enable macros.\nThe navigation ribbon above relies upon the macros to function, and so will be non-responsive. Please close the workbook using the close button within the title bar in the top right corner, or use the File menu (which does not depend on macros) to select Close.\nYou can then re-open the workbook, this time choosing to enable macros.\n\nThis sheet will also appear while the Calculator is loading. Please wait a few seconds to allow it to initialise."]

{"sheet":"All Systems","index":1,"n_rows":23,"n_cols":47,"rows_kept":23,"cut":false,"hidden":true,"merged":[[1,1,1,17],[3,13,3,17],[10,46,11,46],[5,1,5,3],[4,1,4,3],[9,1,9,45],[10,2,11,2],[10,3,11,3],[10,4,11,4],[10,5,11,6],[10,7,10,9],[10,42,10,45],[3,1,3,11],[4,5,4,7],[5,5,5,7],[10,39,10,41],[18,1,18,17],[23,1,23,3],[10,10,10,12],[4,8,4,11],[5,8,5,11],[20,1,20,17],[12,16,12,17],[13,16,13,17],[17,1,17,17],[10,13,10,15],[10,16,11,17],[10,1,11,1],[14,16,14,17]]}
[]
[null,"Calculator  "]
[]
[null,"Project Information",null,null,null,null,null,null,null,null,null,null,null,"Colour Guide"]
[null,"Building Name and Description",null,null,"Project Number","Designer",null,null,"Company",null,null,null,null,"Input","Calculated","N/A","Satisfactory","Not Satisfactory"]
[null,null,null,null,null,null,null,null,null,null,null,null,null,"Gold","White","Grey","Green","Red"]
[]
[null,null,null,null,"Formula reference","VBA reference","Row number"]
[null,null,"Active System",1,{"$f":"CONCATENATE(\"'\",F9,\"'\")","v":"'Pipe Details (104)'"},"Pipe Details (104)",{"$f":"14+Active_System_Number","v":15},null,"Next ID Number",105]
[null,"Systems"]
{"$rows_left_out":14}
{"sheet":"Summary","index":2,"n_rows":35,"n_cols":6,"rows_kept":35,"cut":false,"hidden":true,"merged":[[37,2,37,5],[35,1,35,3],[29,1,29,4],[21,3,21,4],[22,3,22,4],[24,1,24,4],[20,1,20,4],[28,1,28,4],[4,1,4,2],[3,1,3,4],[7,1,7,4],[9,3,10,4],[5,1,5,2],[13,1,13,4],[8,3,8,4],[9,2,10,2]]}
[]
[null,null,null,null,null,"Calculator"]
[]
[null,"System General Information"]
[null,"Building Name and Description",null,"Pump Tag","System Description"]
[null,{"$f":"IF('All Systems'!B6=\"\",\"\",'All Systems'!B6)","v":""},null,{"$f":"IF(INDIRECT(\"'All Systems'!E\" & Active_System_RowNo)=\"\",\"\",INDIRECT(\"'All Systems'!E\" & Active_System_RowNo))","v":""},{"$f":"IF(INDIRECT(\"'All Systems'!D\" & Active_System_RowNo)=\"\",\"\",INDIRECT(\"'All Systems'!D\" & Active_System_RowNo))","v":""}]
[]
[null,"System Characteristics"]
[null,"Pipe System Type","System Speed Control","Operating Hours Per Annum"]
[null,"-Select-","-Select-","-Select-"]
{"$rows_left_out":26}
{"sheet":"Report Template","index":3,"n_rows":37,"n_cols":5,"rows_kept":37,"cut":false,"hidden":true,"merged":[[15,1,15,2],[16,1,16,2],[18,0,18,2],[25,0,25,2],[29,0,29,3],[33,0,33,4],[34,0,34,4],[37,1,37,3],[21,1,21,2],[23,1,23,2],[20,0,21,0],[22,0,23,0],[14,1,14,2],[3,0,3,4],[4,0,4,1],[5,0,5,1],[9,1,9,2],[10,1,10,2],[11,1,11,2],[12,1,12,2],[13,1,13,2],[7,0,7,2],[8,1,8,2]]}
[]
[]
[]
["Project Information"]
[{"$f":"'All Systems'!B5","v":"Building Name and Description"},null,{"$f":"'All Systems'!E5","v":"Project Number"},{"$f":"'All Systems'!F5","v":"Designer"},{"$f":"'All Systems'!I5","v":"Company"}]
[{"$f":"IF('All Systems'!B6=\"\",\"\",'All Systems'!B6)","v":""},null,{"$f":"IF('All Systems'!E6=\"\",\"\",'All Systems'!E6)","v":""},{"$f":"IF('All Systems'!F6=\"\",\"\",'All Systems'!F6)","v":""},{"$f":"IF('All Systems'!I6=\"\",\"\",'All Systems'!I6)","v":""}]
[]
["System Information"]
["Pump Tag:"]
["Description:"]
{"$rows_left_out":28}
{"sheet":"Report","index":4,"n_rows":37,"n_cols":5,"rows_kept":37,"cut":false,"hidden":true,"merged":[[3,0,3,4],[9,1,9,2],[4,0,4,1],[5,0,5,1],[7,0,7,2],[8,1,8,2],[37,1,37,3],[20,0,21,0],[21,1,21,2],[22,0,23,0],[23,1,23,2],[25,0,25,2],[29,0,29,3],[33,0,33,4],[34,0,34,4],[15,1,15,2],[16,1,16,2],[14,1,14,2],[18,0,18,2],[10,1,10,2],[13,1,13,2],[11,1,11,2],[12,1,12,2]]}
[]
[]
[]
["Project Information"]
["Building Name and Description",null,"Project Number","Designer","Company"]
["",null,"","",""]
[]
["System Information"]
["Pump Tag:"]
["Description:"]
{"$rows_left_out":28}
{"sheet":"Pipe Details (104)","index":5,"n_rows":44,"n_cols":25,"rows_kept":44,"cut":false,"hidden":true,"merged":[[26,1,26,2],[26,4,26,5],[29,1,29,18],[39,1,39,13],[40,1,40,2],[40,4,40,5],[40,6,41,13],[41,1,41,2],[41,4,41,5],[25,1,25,2],[25,4,25,5],[15,1,15,2],[16,1,16,2],[17,1,17,2],[18,1,18,2],[19,1,19,2],[20,1,20,2],[21,1,21,2],[22,1,22,2],[23,1,23,2],[24,1,24,2],[24,4,24,5],[13,1,13,3],[13,5,13,8],[3,1,3,8],[4,1,4,3],[4,4,4,5],[4,6,4,8],[5,1,5,3],[5,4,5,5],[5,6,5,8],[7,1,7,5],[8,1,8,2],[8,4,8,5],[9,1,9,2],[9,4,9,5]]}
[]
[null,null,null,null,null,null,null,null,null,null,null,null,null,null,null,null,null,null,null,null,null,null,null,null,"Calculator"]
[null,null,null,null,null,null,null,null,null,null,null,null,null,null,null,null,null,null,null,{"$f":"S3+1","v":1},2,3,4,5]
[null,"System General Information"]
[null,"Building Name and Description",null,null,"Pump Tag",null,"System Description"]
[null,{"$f":"IF(Summary!B6=\"\",\"\",Summary!B6)","v":""},null,null,{"$f":"IF(Summary!D6=\"\",\"\",Summary!D6)","v":""},null,{"$f":"IF(Summary!E6=\"\",\"\",Summary!E6)","v":""}]
[]
[null,"System Characteristics"]
[null,{"$f":"Summary!B9","v":"Pipe System Type"},null,{"$f":"Summary!C9","v":"System Speed Control"},{"$f":"Summary!D9","v":"Operating Hours Per Annum"}]
[null,{"$f":"IF(Summary!B10=\"\",\"\",Summary!B10)","v":"-Select-"},null,{"$f":"IF(Summary!C10=\"\",\"\",Summary!C10)","v":"-Select-"},{"$f":"IF(Summary!D10=\"\",\"\",Summary!D10)","v":"-Select-"}]
{"$rows_left_out":35}
{"sheet":"Pump Details","index":6,"n_rows":50,"n_cols":7,"rows_kept":50,"cut":false,"hidden":true,"merged":[[41,2,42,2],[28,4,28,5],[29,4,29,5],[8,2,8,3],[9,2,9,3],[40,1,40,2],[27,1,27,5],[30,4,30,5],[12,1,13,1],[3,1,3,5],[23,1,23,2],[11,1,11,4],[20,1,20,2],[20,4,20,5],[12,3,13,4],[14,3,14,4],[4,1,4,3],[5,1,5,3],[7,1,7,5]]}
[]
[null,null,null,null,null,null,"Calculator"]
[]
[null,"System General Information"]
[null,"Building Name and Description",null,null,"Pump Tag","System Description"]
[null,{"$f":"IF(Summary!B6=\"\",\"\",Summary!B6)","v":""},null,null,{"$f":"IF(Summary!D6=\"\",\"\",Summary!D6)","v":""},{"$f":"IF(Summary!E6=\"\",\"\",Summary!E6)","v":""}]
[]
[null,"Pump Characteristics"]
[null,"Pump Configuration","Pump Design",null,"Pump Stages","Pump Speed"]
[null,{"$f":"IF(Summary!B16=\"\",\"\",Summary!B16)","v":"-Select-"},{"$f":"IF(Summary!C16=\"\",\"\",Summary!C16)","v":"-Select-"},null,{"$f":"IF(Summary!D16=\"\",\"\",Summary!D16)","v":"-Select-"},{"$f":"IF(Summary!E16=\"\",\"\",Summary!E16)","v":"-Select-"}]
{"$rows_left_out":41}
{"sheet":"Pipe Details (Template)","index":7,"n_rows":44,"n_cols":25,"rows_kept":44,"cut":false,"hidden":true,"merged":[[3,1,3,8],[7,1,7,5],[8,4,8,5],[8,1,8,2],[9,4,9,5],[9,1,9,2],[4,6,4,8],[5,6,5,8],[4,4,4,5],[5,4,5,5],[4,1,4,3],[5,1,5,3],[25,1,25,2],[26,1,26,2],[25,4,25,5],[40,6,41,13],[39,1,39,13],[40,1,40,2],[41,1,41,2],[41,4,41,5],[29,1,29,18],[40,4,40,5],[26,4,26,5],[13,5,13,8],[16,1,16,2],[15,1,15,2],[13,1,13,3],[24,4,24,5],[17,1,17,2],[18,1,18,2],[19,1,19,2],[20,1,20,2],[21,1,21,2],[22,1,22,2],[23,1,23,2],[24,1,24,2]]}
[]
[null,null,null,null,null,null,null,null,null,null,null,null,null,null,null,null,null,null,null,null,null,null,null,null,"Calculator"]
[null,null,null,null,null,null,null,null,null,null,null,null,null,null,null,null,null,null,null,{"$f":"S3+1","v":1},2,3,4,5]
[null,"System General Information"]
[null,"Building Name and Description",null,null,"Pump Tag",null,"System Description"]
[null,{"$f":"IF(Summary!B6=\"\",\"\",Summary!B6)","v":""},null,null,{"$f":"IF(Summary!D6=\"\",\"\",Summary!D6)","v":""},null,{"$f":"IF(Summary!E6=\"\",\"\",Summary!E6)","v":""}]
[]
[null,"System Characteristics"]
[null,{"$f":"Summary!B9","v":"Pipe System Type"},null,{"$f":"Summary!C9","v":"System Speed Control"},{"$f":"Summary!D9","v":"Operating Hours Per Annum"}]
[null,{"$f":"IF(Summary!B10=\"\",\"\",Summary!B10)","v":"-Select-"},null,{"$f":"IF(Summary!C10=\"\",\"\",Summary!C10)","v":"-Select-"},{"$f":"IF(Summary!D10=\"\",\"\",Summary!D10)","v":"-Select-"}]
{"$rows_left_out":35}
{"sheet":"Help Guide","index":8,"n_rows":334,"n_cols":3,"rows_kept":334,"cut":false,"hidden":true,"merged":[[3,1,3,2],[9,1,9,2],[8,1,8,2],[4,1,4,2],[6,1,6,2],[7,1,7,2],[5,1,5,2],[10,1,10,2],[11,1,11,2],[278,1,278,2],[119,1,119,2],[123,1,123,2],[13,1,13,2],[58,1,58,2]]}
[]
[]
[]
[null,"Table of Contents"]
[null,"Technical Information"]
[null,"Information on the calculator, its configuration and operation"]
[null,"How To Use The Calculator"]
[null,"A step-by-step guide to using the calculator"]
[null,"Calculation Details"]
[null,"Background engineering information on how the calculator performs its operations"]
{"$rows_left_out":325}
{"sheet":"Pipe Velocity Check","index":9,"n_rows":36,"n_cols":8,"rows_kept":36,"cut":false,"hidden":true,"merged":[]}
[null,"Pipe Velocity Check Sheet"]
[null,"This sheet is entirely driven by macro, to ensure that cases where J5.7(e )(ii) applies are correctly arbitered"]
[]
[null,"Common Values"]
[null,"Flow Rate","Roughness","Fluid Density","Fluid Dynamic Viscosity","Pressure Drop Requirement"]
[null,"L/s","mm","kg/m3","m2/s","Pa/m"]
[null,5,1.5E-3,999.4,1.234]
[]
[]
[null,"Nominal Pipe Diameter","Internal Pipe Diameter","Pressure Drop","Velocity","Calculated Flow Rate","Pressure Drop Requirement","Reynolds Number"]
{"$rows_left_out":27}
{"sheet":"Lookup Values","index":10,"n_rows":75,"n_cols":10,"rows_kept":75,"cut":false,"hidden":true,"merged":[]}
[]
["System Roles","Reference","Description"]
["-Select-","Z","Please select a circulator to comply with J5.7(b) or another pump to comply with J5.7(c)."]
["Circulator","A","A glandless impeller pump with a rated hydraulic power of less than 2.5kW used in a closed loop system, per EU Commission Regulation No. 622/2012. These are commonly used to circulate heating hot water or as secondary pumps for chilled water systems."]
["Other Pump","B","Any other pump used in an air-conditioning system, in accordance with Articles 1 and 2 of EU Commission Regulation No. 547/2012. Any pump which isn't used as a circulator, or a circulator if above 2.5kW comes under this category."]
[0,"Z","Please select a circulator to comply with J5.7(b) or another pump to comply with J5.7(c)."]
[]
["Pump Types","Reference","Description"]
["-Select-","Z","Please select your pump type using the drop-down menu. This cell will provide a description of the pump selected."]
["End Suction Own Bearing","A","An end suction water pump with own bearings. Commonly called long-coupled pumps."]
{"$rows_left_out":66}
{"sheet":"Pipe System Lookup Values","index":11,"n_rows":66,"n_cols":14,"rows_kept":66,"cut":false,"hidden":true,"merged":[[3,0,19,0],[1,2,1,7],[29,1,29,2],[46,1,46,2],[29,6,29,7],[46,6,46,7]]}
["Table of Internal Diameters"]
[null,null,"Material",null,null,null,null,null,null,"Allowable selections"]
[null,null,"Copper Type B to AS1432","Light Steel to AS1074","Medium Steel to AS1074","Heavy Steel to AS1074","PVC to AS1477 Class PN12","Custom","Maximum PD",{"$f":"C3","v":"Copper Type B to AS1432"},"Light Steel to AS1074","Medium Steel to AS1074","Heavy Steel to AS1074","PVC to AS1477 Class PN12"]
["Nominal Diameter",6,{"$f":"6.27-0.71*2","v":4.8499999999999996},null,null,null,null,null,{"$f":"IF(OR(ISNUMBER(SEARCH(\"Z\",Configuration_Plus_Design)),Summary!$D$12=\"Z\"),\"\",VLOOKUP(B4,INDIRECT(\"Table\"&Summary!$C$19),HLOOKUP(Summary!$D$12,INDIRECT(\"Mini\"&Summary!$C$19),2,TRUE),TRUE))","v":""},6,8,8,8,20]
[null,8,{"$f":"7.86-2*0.71","v":6.44},{"$f":"13.2-1.8*2","v":9.6},{"$f":"13.3-2.3*2","v":8.7000000000000011},{"$f":"13.3-2.9*2","v":7.5000000000000009},null,null,{"$f":"IF(OR(ISNUMBER(SEARCH(\"Z\",Configuration_Plus_Design)),Summary!$D$12=\"Z\"),\"\",VLOOKUP(B5,INDIRECT(\"Table\"&Summary!$C$19),HLOOKUP(Summary!$D$12,INDIRECT(\"Mini\"&Summary!$C$19),2,TRUE),TRUE))","v":""},8,10,10,10,25]
[null,10,{"$f":"9.44-0.91*2","v":7.6199999999999992},{"$f":"16.7-1.8*2","v":13.1},{"$f":"16.8-2*2.3","v":12.200000000000001},{"$f":"16.8-2.9*2","v":11},null,null,{"$f":"IF(OR(ISNUMBER(SEARCH(\"Z\",Configuration_Plus_Design)),Summary!$D$12=\"Z\"),\"\",VLOOKUP(B6,INDIRECT(\"Table\"&Summary!$C$19),HLOOKUP(Summary!$D$12,INDIRECT(\"Mini\"&Summary!$C$19),2,TRUE),TRUE))","v":""},10,15,15,15,32]
[null,15,{"$f":"12.62-0.91*2","v":10.799999999999999},{"$f":"21-2*2","v":17},{"$f":"21.1-2.6*2","v":15.900000000000002},{"$f":"21.1-3.2*2","v":14.700000000000001},null,null,{"$f":"IF(OR(ISNUMBER(SEARCH(\"Z\",Configuration_Plus_Design)),Summary!$D$12=\"Z\"),\"\",VLOOKUP(B7,INDIRECT(\"Table\"&Summary!$C$19),HLOOKUP(Summary!$D$12,INDIRECT(\"Mini\"&Summary!$C$19),2,TRUE),TRUE))","v":""},15,20,20,20,40]
[null,18,{"$f":"15.8-1.02*2","v":13.760000000000002},null,null,null,null,null,{"$f":"IF(OR(ISNUMBER(SEARCH(\"Z\",Configuration_Plus_Design)),Summary!$D$12=\"Z\"),\"\",VLOOKUP(B8,INDIRECT(\"Table\"&Summary!$C$19),HLOOKUP(Summary!$D$12,INDIRECT(\"Mini\"&Summary!$C$19),2,TRUE),TRUE))","v":""},18,25,25,25,50]
[null,20,{"$f":"18.97-1.02*2","v":16.93},{"$f":"26.4-2.3*2","v":21.799999999999997},{"$f":"26.6-2.6*2","v":21.400000000000002},{"$f":"26.6-3.2*2","v":20.200000000000003},{"$f":"26.6-1.7*2","v":23.200000000000003},null,{"$f":"IF(OR(ISNUMBER(SEARCH(\"Z\",Configuration_Plus_Design)),Summary!$D$12=\"Z\"),\"\",VLOOKUP(B9,INDIRECT(\"Table\"&Summary!$C$19),HLOOKUP(Summary!$D$12,INDIRECT(\"Mini\"&Summary!$C$19),2,TRUE),TRUE))","v":""},20,32,32,32,65]
[null,25,{"$f":"25.3-1.22*2","v":22.86},{"$f":"33.2-2.6*2","v":28.000000000000004},{"$f":"33.4-3.2*2","v":27},{"$f":"33.4-4*2","v":25.4},{"$f":"33.4-2.1*2","v":29.2},null,{"$f":"IF(OR(ISNUMBER(SEARCH(\"Z\",Configuration_Plus_Design)),Summary!$D$12=\"Z\"),\"\",VLOOKUP(B10,INDIRECT(\"Table\"&Summary!$C$19),HLOOKUP(Summary!$D$12,INDIRECT(\"Mini\"&Summary!$C$19),2,TRUE),TRUE))","v":""},25,40,40,40,80]
{"$rows_left_out":57}
{"sheet":"Water Properties","index":12,"n_rows":102,"n_cols":3,"rows_kept":102,"cut":false,"hidden":true,"merged":[]}
["Temperature","Dynamic Viscosity","Density"]
[0.01,1.782,999.8]
[1,1.724,999.8]
[2,1.6990000000000001,999.9]
[3,1.6160000000000001,999.9]
[4,1.5649999999999999,999.9]
[5,1.5169999999999999,999.9]
[6,1.4710000000000001,999.9]
[7,1.427,999.9]
[8,1.385,999.8]
{"$rows_left_out":93}
{"sheet":"Worksheet","index":13,"n_rows":5,"n_cols":1,"rows_kept":5,"cut":false,"hidden":true,"merged":[]}
["User's worksheet:"]
["This worksheet has been added for recording notes and making calculations (where desired)."]
["To maintain the integrity of the Calculator, this sheet is protected, which may cause some unavoidable restrictions on the functions available."]
["All cells below row 5 are accessible for user input, editing and formatting, subject to the limitations due to protection."]
["Use of this worksheet and responsibility for its contents and consequences remains entirely with the user."]